BDBM50070929 CHEMBL3409518
SMILES [Li+].CC(C)C[C@H](NP([O-])(=O)CNC(=O)OCc1ccccc1)C(=O)NCCc1ccccc1
InChI Key InChIKey=YDQXQNYYSTUPNL-NRFANRHFSA-M
Data  1 KI
  Tab Delimited (TSV)   2D SDfile   Computed 3D by Vconf -m prep SDfile
Find this compound or compounds like it in BindingDB:
Activity Spreadsheet -- Enzyme Inhibition Constant Data from BindingDB
Found 1 hit for monomerid = 50070929
TargetThermolysin(Bacillus thermoproteolyticus)
The State University Of New York
Curated by ChEMBL
LigandPNGBDBM50070929(CHEMBL3409518)
Affinity DataKi:  296nM. Assay description: Inhibition of Bacillus thermoproteolyticus TLN using 2-furanacryloyl-Gly-Leu-NH2 substrate by biochemical assay
In DepthDetails ArticlePubMed