BDBM50071069 CHEMBL3409759
SMILES Cc1cc(O)cc(C)c1C[C@H](N)C(=O)N1CCc2ccccc2C1C(=O)N[C@@H](Cc1c[nH]c2ccccc12)C(=O)N[C@@H](Cc1ccccc1)C(N)=O
InChI Key InChIKey=ZYJLVFQYADOECE-WJMOUIRLSA-N
Data  3 KI
  Tab Delimited (TSV)   2D SDfile   Computed 3D by Vconf -m prep SDfile
Find this compound or compounds like it in BindingDB:
Activity Spreadsheet -- Enzyme Inhibition Constant Data from BindingDB
Found 3 hits for monomerid = 50071069
TargetDelta-type opioid receptor(Rattus norvegicus (rat))
Zhejiang University
Curated by ChEMBL
LigandPNGBDBM50071069(CHEMBL3409759)
Affinity DataKi:  2nM. Assay description: Displacement of [3H]DPDPE from rat cortex delta opioid receptor after 2.5 hrs by liquid scintillation counting analysis
In DepthDetails ArticlePubMed
TargetMu-type opioid receptor(Rattus norvegicus (rat))
Zhejiang University
Curated by ChEMBL
LigandPNGBDBM50071069(CHEMBL3409759)
Affinity DataKi:  5nM. Assay description: Displacement of [3H]DAMGO from rat cortex mu opioid receptor after 30 mins by liquid scintillation counting analysis
In DepthDetails ArticlePubMed
TargetKappa-type opioid receptor(Cavia porcellus (domestic guinea pig))
Zhejiang University
Curated by ChEMBL
LigandPNGBDBM50071069(CHEMBL3409759)
Affinity DataKi:  289nM. Assay description: Displacement of [3H]U69,593 from guinea pig cortex/cerebella kappa opioid receptor after 2 hrs by liquid scintillation counting analysis
In DepthDetails ArticlePubMed