BDBM50071157 (2R,4R)-4-Amino-1-(4-chloro-benzyl)-pyrrolidine-2,4-dicarboxylic acid::CHEMBL61964
SMILES N[C@@]1(C[C@@H](N(Cc2ccc(Cl)cc2)C1)C(O)=O)C(O)=O
InChI Key InChIKey=MRJISECQFHIMGI-ZWNOBZJWSA-N
Data  4 IC50
  Tab Delimited (TSV)   2D SDfile   Computed 3D by Vconf -m prep SDfile
Find this compound or compounds like it in BindingDB:
Activity Spreadsheet -- Enzyme Inhibition Constant Data from BindingDB
Found 4 hits for monomerid = 50071157
TargetMetabotropic glutamate receptor 5(Homo sapiens (Human))
Eli Lilly
Curated by ChEMBL
LigandPNGBDBM50071157((2R,4R)-4-Amino-1-(4-chloro-benzyl)-pyrrolidine-2,...)
Affinity DataIC50: >3.00E+5nM. Assay description: In vitro antagonist activity at recombinant Metabotropic glutamate receptor 5 expressed in RGT cells.
In DepthDetails ArticlePubMed
TargetMetabotropic glutamate receptor 3(Homo sapiens (Human))
Eli Lilly
Curated by ChEMBL
LigandPNGBDBM50071157((2R,4R)-4-Amino-1-(4-chloro-benzyl)-pyrrolidine-2,...)
Affinity DataIC50: >3.00E+5nM. Assay description: In vitro antagonist activity at recombinant human Metabotropic glutamate receptor 3 expressed in RGT cells.
In DepthDetails ArticlePubMed
TargetMetabotropic glutamate receptor 2(Homo sapiens (Human))
Eli Lilly
Curated by ChEMBL
LigandPNGBDBM50071157((2R,4R)-4-Amino-1-(4-chloro-benzyl)-pyrrolidine-2,...)
Affinity DataIC50: >3.00E+5nM. Assay description: In vitro antagonist activity at recombinant human Metabotropic glutamate receptor 2 expressed in RGT cells.
In DepthDetails ArticlePubMed
TargetMetabotropic glutamate receptor 1(Homo sapiens (Human))
Eli Lilly
Curated by ChEMBL
LigandPNGBDBM50071157((2R,4R)-4-Amino-1-(4-chloro-benzyl)-pyrrolidine-2,...)
Affinity DataIC50: >3.00E+5nM. Assay description: In vitro antagonist activity at recombinant human Metabotropic glutamate receptor 1 expressed in RGT cells.
In DepthDetails ArticlePubMed