BDBM50071166 (2R,4R)-4-Amino-1-(3,3-diphenyl-propyl)-pyrrolidine-2,4-dicarboxylic acid::CHEMBL60302
SMILES N[C@@]1(C[C@@H](N(CCC(c2ccccc2)c2ccccc2)C1)C(O)=O)C(O)=O
InChI Key InChIKey=DNDRXYBPJFRQLZ-WIYYLYMNSA-N
Data  4 IC50
  Tab Delimited (TSV)   2D SDfile   Computed 3D by Vconf -m prep SDfile
Find this compound or compounds like it in BindingDB:
Activity Spreadsheet -- Enzyme Inhibition Constant Data from BindingDB
Found 4 hits for monomerid = 50071166
TargetMetabotropic glutamate receptor 2(Homo sapiens (Human))
Eli Lilly
Curated by ChEMBL
LigandPNGBDBM50071166((2R,4R)-4-Amino-1-(3,3-diphenyl-propyl)-pyrrolidin...)
Affinity DataIC50: >3.00E+5nM. Assay description: In vitro antagonist activity at recombinant human Metabotropic glutamate receptor 2 expressed in RGT cells.
In DepthDetails ArticlePubMed
TargetMetabotropic glutamate receptor 5(Homo sapiens (Human))
Eli Lilly
Curated by ChEMBL
LigandPNGBDBM50071166((2R,4R)-4-Amino-1-(3,3-diphenyl-propyl)-pyrrolidin...)
Affinity DataIC50: >3.00E+5nM. Assay description: In vitro antagonist activity at recombinant Metabotropic glutamate receptor 5 expressed in RGT cells.
In DepthDetails ArticlePubMed
TargetMetabotropic glutamate receptor 4(Homo sapiens (Human))
Eli Lilly
Curated by ChEMBL
LigandPNGBDBM50071166((2R,4R)-4-Amino-1-(3,3-diphenyl-propyl)-pyrrolidin...)
Affinity DataIC50: >3.00E+5nM. Assay description: In vitro antagonist activity at recombinant human Metabotropic glutamate receptor 4 expressed in RGT cells.
In DepthDetails ArticlePubMed
TargetMetabotropic glutamate receptor 1(Homo sapiens (Human))
Eli Lilly
Curated by ChEMBL
LigandPNGBDBM50071166((2R,4R)-4-Amino-1-(3,3-diphenyl-propyl)-pyrrolidin...)
Affinity DataIC50: >3.00E+5nM. Assay description: In vitro antagonist activity at recombinant human Metabotropic glutamate receptor 1 expressed in RGT cells.
In DepthDetails ArticlePubMed