BDBM50071184 9-Methoxy-2-methyl-11,12-dihydro-3H,6aH,13H-6-oxa-3,12a-diaza-benzo[a]cyclopenta[h]anthracene-1-carboxylic acid isopropyl ester::CHEMBL62251
SMILES COc1ccc2C3Oc4ccc5[nH]c(C)c(C(=O)OC(C)C)c5c4CN3CCc2c1
InChI Key InChIKey=QPMSDLVPDBQHOL-UHFFFAOYSA-N
Data  5 IC50
  Tab Delimited (TSV)   2D SDfile   Computed 3D by Vconf -m prep SDfile
Find this compound or compounds like it in BindingDB:
Activity Spreadsheet -- Enzyme Inhibition Constant Data from BindingDB
Found 5 hits for monomerid = 50071184
TargetMuscarinic acetylcholine receptor M3(Homo sapiens (Human))
Parke-Davis Pharmaceutical Research
Curated by ChEMBL
LigandPNGBDBM50071184(9-Methoxy-2-methyl-11,12-dihydro-3H,6aH,13H-6-oxa-...)
Affinity DataIC50:  2.82E+3nM. Assay description: Evaluated for its binding affinity at human muscarinic receptor m3 by the displacement of [3H]NMS binding using membranes from transfected chinese ha...
In DepthDetails ArticlePubMed
TargetMuscarinic acetylcholine receptor M1(Homo sapiens (Human))
Parke-Davis Pharmaceutical Research
Curated by ChEMBL
LigandPNGBDBM50071184(9-Methoxy-2-methyl-11,12-dihydro-3H,6aH,13H-6-oxa-...)
Affinity DataIC50:  4.06E+3nM. Assay description: Evaluated for its binding affinity at human muscarinic receptor m1 by displacement of [3H]NMS binding using membranes in transfected chinese hamster ...
In DepthDetails ArticlePubMed
TargetMuscarinic acetylcholine receptor M4(Homo sapiens (Human))
Parke-Davis Pharmaceutical Research
Curated by ChEMBL
LigandPNGBDBM50071184(9-Methoxy-2-methyl-11,12-dihydro-3H,6aH,13H-6-oxa-...)
Affinity DataIC50:  2.05E+3nM. Assay description: Evaluated for its binding affinity at human muscarinic receptor m4 by the displacement of [3H]NMS binding using membranes from transfected chinese ha...
In DepthDetails ArticlePubMed
TargetMuscarinic acetylcholine receptor M5(Homo sapiens (Human))
Parke-Davis Pharmaceutical Research
Curated by ChEMBL
LigandPNGBDBM50071184(9-Methoxy-2-methyl-11,12-dihydro-3H,6aH,13H-6-oxa-...)
Affinity DataIC50:  4.74E+3nM. Assay description: Evaluated for its binding affinity at human muscarinic receptor m5 by the displacement of [3H]NMS binding using membranes from transfected chinese ha...
In DepthDetails ArticlePubMed
TargetMuscarinic acetylcholine receptor M2(Homo sapiens (Human))
Parke-Davis Pharmaceutical Research
Curated by ChEMBL
LigandPNGBDBM50071184(9-Methoxy-2-methyl-11,12-dihydro-3H,6aH,13H-6-oxa-...)
Affinity DataIC50:  2.64E+3nM. Assay description: Evaluated for its binding affinity at human muscarinic receptor m2 by displacement of [3H]NMS binding using membranes from transfected chinese hamste...
In DepthDetails ArticlePubMed