BDBM50071264 (9S,10R,13S)-10-Isobutyl-11-oxo-2-oxa-12-aza-bicyclo[13.2.2]nonadeca-1(18),15(19),16-triene-9,13-dicarboxylic acid 9-hydroxyamide 13-methylamide::CHEMBL293003
SMILES CNC(=O)[C@@H]1Cc2ccc(OCCCCCC[C@@H]([C@@H](CC(C)C)C(=O)N1)C(=O)NO)cc2
InChI Key InChIKey=VCJOCQOXJUMEBE-HBMCJLEFSA-N
Data  4 IC50
  Tab Delimited (TSV)   2D SDfile   Computed 3D by Vconf -m prep SDfile
Find this compound or compounds like it in BindingDB:
Activity Spreadsheet -- Enzyme Inhibition Constant Data from BindingDB
Found 4 hits for monomerid = 50071264
TargetInterstitial collagenase(Homo sapiens (Human))
Abbott Laboratories
Curated by ChEMBL
LigandPNGBDBM50071264((9S,10R,13S)-10-Isobutyl-11-oxo-2-oxa-12-aza-bicyc...)
Affinity DataIC50:  2.20nM. Assay description: Inhibition of fibroblast collagenase (MMP-1)
In DepthDetails ArticlePubMed
TargetMatrilysin(Homo sapiens (Human))
Abbott Laboratories
Curated by ChEMBL
LigandPNGBDBM50071264((9S,10R,13S)-10-Isobutyl-11-oxo-2-oxa-12-aza-bicyc...)
Affinity DataIC50:  5.70nM. Assay description: Inhibition of fibroblast matrilysin (MMP-7)
In DepthDetails ArticlePubMed
Target72 kDa type IV collagenase(Homo sapiens (Human))
Abbott Laboratories
Curated by ChEMBL
LigandPNGBDBM50071264((9S,10R,13S)-10-Isobutyl-11-oxo-2-oxa-12-aza-bicyc...)
Affinity DataIC50:  5.90nM. Assay description: Inhibition of fibroblast gelatinase A (MMP-2)
In DepthDetails ArticlePubMed
TargetStromelysin-1(Homo sapiens (Human))
Abbott Laboratories
Curated by ChEMBL
LigandPNGBDBM50071264((9S,10R,13S)-10-Isobutyl-11-oxo-2-oxa-12-aza-bicyc...)
Affinity DataIC50:  12nM. Assay description: Inhibition of fibroblast stromelysin (MMP-3)
In DepthDetails ArticlePubMed