BDBM50071576 CHEMBL3410463
SMILES Nc1nc(N)c2cc(NCc3ccc(cc3)[N+]([O-])=O)ccc2n1
InChI Key InChIKey=OINKATJNOAYBEF-UHFFFAOYSA-N
Data  2 Kd
  Tab Delimited (TSV)   2D SDfile   Computed 3D by Vconf -m prep SDfile
Find this compound or compounds like it in BindingDB:
Activity Spreadsheet -- Enzyme Inhibition Constant Data from BindingDB
Found 2 hits for monomerid = 50071576
TargetBifunctional dihydrofolate reductase-thymidylate synthase(Leishmania major)
Universidad Nacional Aut£Noma De M£Xico
Curated by ChEMBL
LigandPNGBDBM50071576(CHEMBL3410463)
Affinity DataKd:  241nM. Assay description: Binding affinity to Leishmania major DHFR
In DepthDetails ArticlePubMed
TargetPteridine reductase 1(Leishmania major)
Universidad Nacional Aut£Noma De M£Xico
Curated by ChEMBL
LigandPNGBDBM50071576(CHEMBL3410463)
Affinity DataKd:  1.43E+3nM. Assay description: Binding affinity to Leishmania major pteridine reductase 1
In DepthDetails ArticlePubMed