BDBM50071755 (S)-3-(1H-Indol-3-yl)-N-[1-(2-methoxy-phenyl)-cyclohexylmethyl]-2-methyl-2-[3-(4-nitro-phenyl)-ureido]-propionamide::CHEMBL89734
SMILES COc1ccccc1C1(CNC(=O)[C@](C)(Cc2c[nH]c3ccccc23)NC(=O)Nc2ccc(cc2)[N+]([O-])=O)CCCCC1
InChI Key InChIKey=IGGDYDYGUOVJQB-YTTGMZPUSA-N
Data  2 KI
  Tab Delimited (TSV)   2D SDfile   Computed 3D by Vconf -m prep SDfile
Find this compound or compounds like it in BindingDB:
Activity Spreadsheet -- Enzyme Inhibition Constant Data from BindingDB
Found 2 hits for monomerid = 50071755
TargetNeuromedin-B receptor(Homo sapiens (Human))
Cambridge University Forvie Site
Curated by ChEMBL
LigandPNGBDBM50071755((S)-3-(1H-Indol-3-yl)-N-[1-(2-methoxy-phenyl)-cycl...)
Affinity DataKi:  3.40nM. Assay description: Antagonism of recombinant human bombesin receptor (bb1) labeled with [125I]- [Tyr] bombesin stably expressed in CHO cells
In DepthDetails ArticlePubMed
TargetGastrin-releasing peptide receptor(Homo sapiens (Human))
Cambridge University Forvie Site
Curated by ChEMBL
LigandPNGBDBM50071755((S)-3-(1H-Indol-3-yl)-N-[1-(2-methoxy-phenyl)-cycl...)
Affinity DataKi:  404nM. Assay description: In vitro binding affinity at Bombesin BB2 receptor in the presence of [125I]-[Tyr] bombesin.
In DepthDetails ArticlePubMed