BDBM50071757 CHEMBL3410584
SMILES CCOC(=O)c1sc(Nc2ccc(C)c(C)c2)nc1NC(=O)C1CC1
InChI Key InChIKey=VRVDTLRDHZLCES-UHFFFAOYSA-N
Data  1 IC50
  Tab Delimited (TSV)   2D SDfile   Computed 3D by Vconf -m prep SDfile
Find this compound or compounds like it in BindingDB:
Activity Spreadsheet -- Enzyme Inhibition Constant Data from BindingDB
Found 1 hit for monomerid = 50071757
TargetDihydroorotate dehydrogenase (quinone), mitochondrial(Homo sapiens (Human))
East China University Of Science And Techology
Curated by ChEMBL
LigandPNGBDBM50071757(CHEMBL3410584)
Affinity DataIC50: >1.00E+4nM. Assay description: Inhibition of human DHODH using dihydroorotate substrate by DCIP assay
In DepthDetails ArticlePubMed