BDBM50072239 CHEMBL3408316
SMILES Cc1ccc(cc1)-n1c2cc(ccc2n(C)c1=O)C(=O)c1cnn(C)c1O
InChI Key InChIKey=MRDMDJGKKAMPPO-UHFFFAOYSA-N
Data  1 IC50
  Tab Delimited (TSV)   2D SDfile   Computed 3D by Vconf -m prep SDfile
Find this compound or compounds like it in BindingDB:
Activity Spreadsheet -- Enzyme Inhibition Constant Data from BindingDB
Found 1 hit for monomerid = 50072239
Target4-hydroxyphenylpyruvate dioxygenase(Homo sapiens (Human))
Central China Normal University
Curated by ChEMBL
LigandPNGBDBM50072239(CHEMBL3408316)
Affinity DataIC50:  250nM. Assay description: Inhibition of human recombinant His-tagged HPPD expressed in Escherichia coli BL21(DE3) by UV/visible plate reader analysis
In DepthDetails ArticlePubMed