BDBM50072338 3-((S)-7-Methoxy-5-oxo-2,3,5,11a-tetrahydro-1H-benzo[e]pyrrolo[1,2-a][1,4]diazepin-8-yloxy)-propionic acid methyl ester::CHEMBL300580
SMILES COC(=O)CCOc1cc2N=C[C@@H]3CCCN3C(=O)c2cc1OC
InChI Key InChIKey=NARFTINXSTWTEK-NSHDSACASA-N
Data  1 IC50
  Tab Delimited (TSV)   2D SDfile   Computed 3D by Vconf -m prep SDfile
Find this compound or compounds like it in BindingDB:
Activity Spreadsheet -- Enzyme Inhibition Constant Data from BindingDB
Found 1 hit for monomerid = 50072338
TargetGTPase HRas(Homo sapiens (Human))
Universit£
Curated by ChEMBL
LigandPNGBDBM50072338(3-((S)-7-Methoxy-5-oxo-2,3,5,11a-tetrahydro-1H-ben...)
Affinity DataIC50: >3.00E+5nM. Assay description: Inhibition of Ha-ras polymerase-chain reaction product
In DepthDetails ArticlePubMed