BDBM50072379 (4-{4-[2-((R)-2-Hydroxy-2-pyridin-3-yl-ethylamino)-ethyl]-phenylsulfamoyl}-phenyl)-carbamic acid hexyl ester::CHEMBL321957
SMILES CCCCCCOC(=O)Nc1ccc(cc1)S(=O)(=O)Nc1ccc(CCNC[C@H](O)c2cccnc2)cc1
InChI Key InChIKey=AQJAFHZELYBXMJ-MHZLTWQESA-N
Data  1 IC50  1 EC50
  Tab Delimited (TSV)   2D SDfile   Computed 3D by Vconf -m prep SDfile
Find this compound or compounds like it in BindingDB:
Activity Spreadsheet -- Enzyme Inhibition Constant Data from BindingDB
Found 2 hits for monomerid = 50072379
TargetBeta-1 adrenergic receptor(Homo sapiens (Human))
Merck Research Laboratories
Curated by ChEMBL
LigandPNGBDBM50072379((4-{4-[2-((R)-2-Hydroxy-2-pyridin-3-yl-ethylamino)...)
Affinity DataIC50:  2.00E+3nM. Assay description: Beta-1 adrenergic receptor binding affinity in CHO cells expressing cloned human receptor in the presence of 125 I-iodocyanopindolol
In DepthDetails ArticlePubMed
TargetBeta-3 adrenergic receptor(Homo sapiens (Human))
Merck Research Laboratories
Curated by ChEMBL
LigandPNGBDBM50072379((4-{4-[2-((R)-2-Hydroxy-2-pyridin-3-yl-ethylamino)...)
Affinity DataEC50:  27nM. Assay description: Agonism against Beta-3 adrenergic receptor
In DepthDetails ArticlePubMed