BDBM50072427 1-(1-(2-(isopropyl(phenyl)amino)-2-oxoethyl)-2,4-dioxo-5-phenyl-2,3,4,5-tetrahydro-1H-benzo[b][1,4]diazepin-3-yl)-3-phenylurea::2-[2,4-Dioxo-5-phenyl-3-(3-phenyl-ureido)-2,3,4,5-tetrahydro-benzo[b][1,4]diazepin-1-yl]-N-isopropyl-N-phenyl-acetamide::CHEMBL321761
SMILES CC(C)N(C(=O)CN1c2ccccc2N(c2ccccc2)C(=O)C(NC(=O)Nc2ccccc2)C1=O)c1ccccc1
InChI Key InChIKey=ITMJPTIFWLPIOL-UHFFFAOYSA-N
Data  9 IC50  1 EC50
  Tab Delimited (TSV)   2D SDfile   Computed 3D by Vconf -m prep SDfile
Find this compound or compounds like it in BindingDB:
Activity Spreadsheet -- Enzyme Inhibition Constant Data from BindingDB
Found 10 hits for monomerid = 50072427
TargetCholecystokinin receptor type A(Homo sapiens (Human))
Glaxo Wellcome Research And Development
Curated by ChEMBL
LigandPNGBDBM50072427(1-(1-(2-(isopropyl(phenyl)amino)-2-oxoethyl)-2,4-d...)
Affinity DataIC50:  50nM. Assay description: Tested for the 50% displacement of [125I]CCK-8 from membrane preparation isolated from CHO-K1 cells stably transfected with the cDNA of human Cholecy...
In DepthDetails Article
TargetGastrin/cholecystokinin type B receptor(Homo sapiens (Human))
Glaxo Wellcome Research And Development
Curated by ChEMBL
LigandPNGBDBM50072427(1-(1-(2-(isopropyl(phenyl)amino)-2-oxoethyl)-2,4-d...)
Affinity DataIC50:  25nM. Assay description: Tested for 50% displacement of [125I]CCK-8 from membrane preparation isolated from CHO-K1 cells stably transfected with the cDNA of human Cholecystok...
In DepthDetails Article
TargetCholecystokinin receptor type A(RAT)
Neurogen
Curated by ChEMBL
LigandPNGBDBM50072427(1-(1-(2-(isopropyl(phenyl)amino)-2-oxoethyl)-2,4-d...)
Affinity DataIC50:  250nM. Assay description: Displacement of 125I]-D-Tyr-Gly-[(Nle28,31)CCK-26-33] from rat cell membrane Cholecystokinin type A receptor
In DepthDetails ArticlePubMed
TargetCholecystokinin receptor type A(Homo sapiens (Human))
Glaxo Wellcome Research And Development
Curated by ChEMBL
LigandPNGBDBM50072427(1-(1-(2-(isopropyl(phenyl)amino)-2-oxoethyl)-2,4-d...)
Affinity DataIC50:  55nM. Assay description: Binding affinity against human Cholecystokinin type A receptor in membrane preparation isolated from CHO-K1 cells stably transfected with cDNA of hum...
In DepthDetails ArticlePubMed
TargetCholecystokinin receptor type A/Gastrin/cholecystokinin type B receptor(Homo sapiens (Human))
Glaxo Wellcome Research And Development
Curated by ChEMBL
LigandPNGBDBM50072427(1-(1-(2-(isopropyl(phenyl)amino)-2-oxoethyl)-2,4-d...)
Affinity DataEC50:  1.60E+3nM. Assay description: Concentration of compound that induced 50% of the maximal contraction in guinea pig gallbladder tissue when tested in vitro
In DepthDetails Article
TargetCholecystokinin receptor type A(Homo sapiens (Human))
Glaxo Wellcome Research And Development
Curated by ChEMBL
LigandPNGBDBM50072427(1-(1-(2-(isopropyl(phenyl)amino)-2-oxoethyl)-2,4-d...)
Affinity DataIC50:  50nM. Assay description: Concentration required to displace [125I]Bolton-Hunter CCK-8 from human Cholecystokinin type A receptor stably expressed in CHO-K1 cells
In DepthDetails ArticlePubMed
TargetGastrin/cholecystokinin type B receptor(Homo sapiens (Human))
Glaxo Wellcome Research And Development
Curated by ChEMBL
LigandPNGBDBM50072427(1-(1-(2-(isopropyl(phenyl)amino)-2-oxoethyl)-2,4-d...)
Affinity DataIC50:  25nM. Assay description: Concentration required to displace [125I]Bolton-Hunter CCK-8 from human Cholecystokinin type B receptor expressed in CHO-K1 cells
In DepthDetails ArticlePubMed
TargetGastrin/cholecystokinin type B receptor(Homo sapiens (Human))
Glaxo Wellcome Research And Development
Curated by ChEMBL
LigandPNGBDBM50072427(1-(1-(2-(isopropyl(phenyl)amino)-2-oxoethyl)-2,4-d...)
Affinity DataIC50:  25nM. Assay description: Compound was tested in vitro for its ability to displace [125I]Bolton-Hunter CCK-8 from membrane preparation isolated from CHO-KI cells stably transf...
In DepthDetails ArticlePubMed
TargetCholecystokinin receptor type A(Homo sapiens (Human))
Glaxo Wellcome Research And Development
Curated by ChEMBL
LigandPNGBDBM50072427(1-(1-(2-(isopropyl(phenyl)amino)-2-oxoethyl)-2,4-d...)
Affinity DataIC50:  50nM. Assay description: Compound was tested in vitro for its ability to displace [125I]Bolton-Hunter CCK-8 from membrane preparation isolated from CHO-KI cells stably transf...
In DepthDetails ArticlePubMed
TargetGastrin/cholecystokinin type B receptor(Homo sapiens (Human))
Glaxo Wellcome Research And Development
Curated by ChEMBL
LigandPNGBDBM50072427(1-(1-(2-(isopropyl(phenyl)amino)-2-oxoethyl)-2,4-d...)
Affinity DataIC50:  24nM. Assay description: Binding affinity against human Cholecystokinin type B receptor in CHO-K1 cells using [125I]-Bolton-Hunter CCK-8 as radioligand
In DepthDetails ArticlePubMed