BDBM50072474 CHEMBL418999::{(S)-7-[(1H-Benzoimidazol-2-ylmethyl)-butyl-carbamoyl]-4-methyl-3-oxo-2,3,4,5-tetrahydro-1H-benzo[e][1,4]diazepin-2-yl}-acetic acid
SMILES CCCCN(Cc1nc2ccccc2[nH]1)C(=O)c1ccc2N[C@@H](CC(O)=O)C(=O)N(C)Cc2c1
InChI Key InChIKey=PXOGKUFBOAEMKF-NRFANRHFSA-N
Data  1 KI  1 IC50
  Tab Delimited (TSV)   2D SDfile   Computed 3D by Vconf -m prep SDfile
Find this compound or compounds like it in BindingDB:
Activity Spreadsheet -- Enzyme Inhibition Constant Data from BindingDB
Found 2 hits for monomerid = 50072474
TargetIntegrin alpha-V/beta-3(Homo sapiens (Human))
Smithkline Beecham Pharmaceuticals
Curated by ChEMBL
LigandPNGBDBM50072474(CHEMBL418999 | {(S)-7-[(1H-Benzoimidazol-2-ylmethy...)
Affinity DataKi:  3.5nM. Assay description: Effect against adhesion of HEK 293 cells transfected with human alpha-v beta-3 to vitronectin coated plates
In DepthDetails ArticlePubMed
TargetIntegrin alpha-V/beta-3(Homo sapiens (Human))
Smithkline Beecham Pharmaceuticals
Curated by ChEMBL
LigandPNGBDBM50072474(CHEMBL418999 | {(S)-7-[(1H-Benzoimidazol-2-ylmethy...)
Affinity DataIC50:  520nM. Assay description: Effect against adhesion of HEK 293 cells transfected with human alpha-v beta-3 to vitronectin coated plates
In DepthDetails ArticlePubMed