BDBM50072502 CHEMBL327112::{(S)-4-Methyl-7-[methyl-(7-nitro-1H-benzoimidazol-2-ylmethyl)-carbamoyl]-3-oxo-2,3,4,5-tetrahydro-1H-benzo[e][1,4]diazepin-2-yl}-acetic acid
SMILES CN(Cc1nc2c(cccc2[nH]1)[N+]([O-])=O)C(=O)c1ccc2N[C@@H](CC(O)=O)C(=O)N(C)Cc2c1
InChI Key InChIKey=NJVVLFTVLHGRKR-INIZCTEOSA-N
Data  1 KI  1 IC50
  Tab Delimited (TSV)   2D SDfile   Computed 3D by Vconf -m prep SDfile
Find this compound or compounds like it in BindingDB:
Activity Spreadsheet -- Enzyme Inhibition Constant Data from BindingDB
Found 2 hits for monomerid = 50072502
TargetIntegrin alpha-V/beta-3(Homo sapiens (Human))
Smithkline Beecham Pharmaceuticals
Curated by ChEMBL
LigandPNGBDBM50072502(CHEMBL327112 | {(S)-4-Methyl-7-[methyl-(7-nitro-1H...)
Affinity DataKi:  13nM. Assay description: Effect against adhesion of HEK 293 cells transfected with human alpha-v beta-3 to vitronectin coated plates
In DepthDetails ArticlePubMed
TargetIntegrin alpha-V/beta-3(Homo sapiens (Human))
Smithkline Beecham Pharmaceuticals
Curated by ChEMBL
LigandPNGBDBM50072502(CHEMBL327112 | {(S)-4-Methyl-7-[methyl-(7-nitro-1H...)
Affinity DataIC50:  1.10E+3nM. Assay description: Effect against adhesion of HEK 293 cells transfected with human alpha-v beta-3 to vitronectin coated plates
In DepthDetails ArticlePubMed