BDBM50072516 CHEMBL419374::{(S)-4-(3,3-Dimethyl-butyl)-7-[(1H-imidazo[4,5-b]pyridin-2-ylmethyl)-methyl-carbamoyl]-3-oxo-2,3,4,5-tetrahydro-1H-benzo[e][1,4]diazepin-2-yl}-acetic acid
SMILES CN(Cc1nc2ncccc2[nH]1)C(=O)c1ccc2N[C@@H](CC(O)=O)C(=O)N(CCC(C)(C)C)Cc2c1
InChI Key InChIKey=JFGWITIVJGEHEK-FQEVSTJZSA-N
Data  1 KI
  Tab Delimited (TSV)   2D SDfile   Computed 3D by Vconf -m prep SDfile
Find this compound or compounds like it in BindingDB:
Activity Spreadsheet -- Enzyme Inhibition Constant Data from BindingDB
Found 1 hit for monomerid = 50072516
TargetIntegrin alpha-V/beta-3(Homo sapiens (Human))
Smithkline Beecham Pharmaceuticals
Curated by ChEMBL
LigandPNGBDBM50072516(CHEMBL419374 | {(S)-4-(3,3-Dimethyl-butyl)-7-[(1H-...)
Affinity DataKi:  2.5nM. Assay description: Antagonistic activity for human vitronectin receptor (alphaV-beta3) from platelets
In DepthDetails ArticlePubMed