BDBM50072986 7-Methylsulfanyl-1,2,3,4-tetrahydro-isoquinoline::CHEMBL28329
SMILES CSc1ccc2CCNCc2c1
InChI Key InChIKey=XXVAZHMAHYNQBC-UHFFFAOYSA-N
Data  3 KI
  Tab Delimited (TSV)   2D SDfile   Computed 3D by Vconf -m prep SDfile
Find this compound or compounds like it in BindingDB:
Activity Spreadsheet -- Enzyme Inhibition Constant Data from BindingDB
Found 3 hits for monomerid = 50072986
TargetPhenylethanolamine N-methyltransferase(Bos taurus (bovine))
University Of Kansas
Curated by ChEMBL
LigandPNGBDBM50072986(7-Methylsulfanyl-1,2,3,4-tetrahydro-isoquinoline |...)
Affinity DataKi:  610nM. Assay description: In vitro inhibitory activity against bovine adrenal phenylethanolamine N-methyltransferase(PNMT)
In DepthDetails ArticlePubMed
LigandPNGBDBM50072986(7-Methylsulfanyl-1,2,3,4-tetrahydro-isoquinoline |...)
Affinity DataKi:  1.68E+3nM. Assay description: Inhibition of [3H]clonidine binding to the rat alpha-2-adrenoceptor
In DepthDetails ArticlePubMed
TargetPhenylethanolamine N-methyltransferase(Bos taurus (bovine))
University Of Kansas
Curated by ChEMBL
LigandPNGBDBM50072986(7-Methylsulfanyl-1,2,3,4-tetrahydro-isoquinoline |...)
Affinity DataKi:  2.01E+3nM. Assay description: Inhibitory activity against bovine adrenal phenylethanolamine N-methyl-transferase (PNMT)
In DepthDetails ArticlePubMed