BDBM50073051 CHEMBL60319::N-[5-(3,4-Dimethoxy-phenyl)-1H-pyrazol-3-yl]-2-(1,2,3,4,9,9a-hexahydro-cyclopenta[b]naphthalen-3a-yl)-acetamide
SMILES COc1ccc(cc1OC)-c1cc(NC(=O)CC23CCCC2Cc2ccccc2C3)[nH]n1
InChI Key InChIKey=JRZOLZQPBHYTCP-UHFFFAOYSA-N
Data  1 IC50
  Tab Delimited (TSV)   2D SDfile   Computed 3D by Vconf -m prep SDfile
Find this compound or compounds like it in BindingDB:
Activity Spreadsheet -- Enzyme Inhibition Constant Data from BindingDB
Found 1 hit for monomerid = 50073051
TargetNeuropeptide Y receptor type 5(Rat 6B)
The R. W. Johnson Pharmaceutical Research Institute
Curated by ChEMBL
LigandPNGBDBM50073051(CHEMBL60319 | N-[5-(3,4-Dimethoxy-phenyl)-1H-pyraz...)
Affinity DataIC50:  2.30nM. Assay description: The compound was tested for the binding affinity against Neuropeptide Y receptor type 5 in rat
In DepthDetails ArticlePubMed