BDBM50073210 (S)-2-Benzyl-3-(formyl-hydroxy-amino)-N-methyl-propionamide::CHEMBL118422
SMILES CNC(=O)[C@H](CN(O)C=O)Cc1ccccc1
InChI Key InChIKey=MPMRMCPMVCKAFF-NSHDSACASA-N
Data  1 KI
  Tab Delimited (TSV)   2D SDfile   Computed 3D by Vconf -m prep SDfile
Find this compound or compounds like it in BindingDB:
Activity Spreadsheet -- Enzyme Inhibition Constant Data from BindingDB
Found 1 hit for monomerid = 50073210
TargetThermolysin(Bacillus thermoproteolyticus)
Pohang University Of Science And Technology
Curated by ChEMBL
LigandPNGBDBM50073210((S)-2-Benzyl-3-(formyl-hydroxy-amino)-N-methyl-pro...)
Affinity DataKi:  1.66E+3nM. Assay description: Inhibitory activity against thermolysin
In DepthDetails ArticlePubMed