BDBM50073241 CHEMBL3408638
SMILES CC(C)C(=O)Nc1cccc(c1)C(\C)=N\NC(N)=S
InChI Key InChIKey=BMGYXTADSXSLQY-CXUHLZMHSA-N
Data  1 IC50
  Tab Delimited (TSV)   2D SDfile   Computed 3D by Vconf -m prep SDfile
Find this compound or compounds like it in BindingDB:
Activity Spreadsheet -- Enzyme Inhibition Constant Data from BindingDB
Found 1 hit for monomerid = 50073241
TargetPolyphenol oxidase 2(Agaricus bisporus (Common mushroom))
Sun Yat-Sen University
Curated by ChEMBL
LigandPNGBDBM50073241(CHEMBL3408638)
Affinity DataIC50:  3.62E+3nM. Assay description: Inhibition of mushroom tyrosinase diphenolase activity using L-DOPA as substrate preincubated for 30 mins followed by substrate addition measured for...
In DepthDetails ArticlePubMed