BDBM50073271 7-[3-(4-Phenyl-piperazin-1-yl)-propoxy]-chromen-2-one::CHEMBL120590
SMILES O=c1ccc2ccc(OCCCN3CCN(CC3)c3ccccc3)cc2o1
InChI Key InChIKey=MULLDMIPFVHJIA-UHFFFAOYSA-N
Data  3 KI
  Tab Delimited (TSV)   2D SDfile   Computed 3D by Vconf -m prep SDfile
Find this compound or compounds like it in BindingDB:
Activity Spreadsheet -- Enzyme Inhibition Constant Data from BindingDB
Found 3 hits for monomerid = 50073271
Target5-hydroxytryptamine receptor 1A(Rattus norvegicus (rat))
University Of Vigo
Curated by ChEMBL
LigandPNGBDBM50073271(7-[3-(4-Phenyl-piperazin-1-yl)-propoxy]-chromen-2-...)
Affinity DataKi:  5.60nM. Assay description: Compound was measured for the inhibition of [3H]-8-OH-DPAT binding to rat hippocampus membrane (5-HT1A receptor)
In DepthDetails ArticlePubMed
TargetD(2) dopamine receptor(Homo sapiens (Human))
University Of Vigo
Curated by ChEMBL
LigandPNGBDBM50073271(7-[3-(4-Phenyl-piperazin-1-yl)-propoxy]-chromen-2-...)
Affinity DataKi:  16nM. Assay description: Compound was measured for the binding affinity in homogenated mouse fibroblast (LTK) cells transfected with human Dopamine receptor D2A using [3H]-ra...
In DepthDetails ArticlePubMed
TargetD(3) dopamine receptor(Homo sapiens (Human))
University Of Vigo
Curated by ChEMBL
LigandPNGBDBM50073271(7-[3-(4-Phenyl-piperazin-1-yl)-propoxy]-chromen-2-...)
Affinity DataKi:  50nM. Assay description: Compound was measured for the binding affinity in chinese hamster ovary (CHO) cells transfected with human Dopamine receptor D3 using [3H]-raclopride...
In DepthDetails ArticlePubMed