BDBM50073325 (2R,3R,4R)-4,5-Dibenzyl-2,3-dihydroxy-5,7-diaza-tricyclo[6.2.2.0*1,7*]dodecan-6-one::CHEMBL120521
SMILES O[C@@H]1[C@@H](Cc2ccccc2)N(Cc2ccccc2)C(=O)N2[C@H]3CC[C@@]2(CC3)[C@H]1O
InChI Key InChIKey=HZRLIXRIKBJBFN-HGUQERDASA-N
Data  1 KI
  Tab Delimited (TSV)   2D SDfile   Computed 3D by Vconf -m prep SDfile
Find this compound or compounds like it in BindingDB:
Activity Spreadsheet -- Enzyme Inhibition Constant Data from BindingDB
Found 1 hit for monomerid = 50073325
TargetGag-Pol polyprotein [489-587](Human immunodeficiency virus type 1)
Dupont Pharmaceuticals
Curated by ChEMBL
LigandPNGBDBM50073325((2R,3R,4R)-4,5-Dibenzyl-2,3-dihydroxy-5,7-diaza-tr...)
Affinity DataKi:  6.30E+3nM. Assay description: Compound was tested for the inhibition of HIV-1 protease by assaying the cleavage of a fluorescent peptide using HPLC
In DepthDetails ArticlePubMed