BDBM50073454 1-Ethyl-4-phenyl-1,2,5,6-tetrahydro-pyridine-3-carboxylic acid cyclohexylmethyl ester; oxalic acid::CHEMBL121520
SMILES CCN1CCC(=C(C1)C(=O)OCC1CCCCC1)c1ccccc1
InChI Key InChIKey=HBLWDHBKUANPEG-UHFFFAOYSA-N
Data  5 IC50
  Tab Delimited (TSV)   2D SDfile   Computed 3D by Vconf -m prep SDfile
Find this compound or compounds like it in BindingDB:
Activity Spreadsheet -- Enzyme Inhibition Constant Data from BindingDB
Found 5 hits for monomerid = 50073454
TargetMuscarinic acetylcholine receptor M4(Homo sapiens (Human))
Warner-Lambert
Curated by ChEMBL
LigandPNGBDBM50073454(1-Ethyl-4-phenyl-1,2,5,6-tetrahydro-pyridine-3-car...)
Affinity DataIC50:  143nM. Assay description: Displacement of [3H]NMS binding to human Muscarinic acetylcholine receptor M4 using membranes from transfected CHO cells
In DepthDetails ArticlePubMed
TargetMuscarinic acetylcholine receptor M3(Homo sapiens (Human))
Warner-Lambert
Curated by ChEMBL
LigandPNGBDBM50073454(1-Ethyl-4-phenyl-1,2,5,6-tetrahydro-pyridine-3-car...)
Affinity DataIC50:  156nM. Assay description: Displacement of [3H]-NMS binding to human Muscarinic acetylcholine receptor M3 using membranes from transfected CHO cells
In DepthDetails ArticlePubMed
TargetMuscarinic acetylcholine receptor M5(Homo sapiens (Human))
Warner-Lambert
Curated by ChEMBL
LigandPNGBDBM50073454(1-Ethyl-4-phenyl-1,2,5,6-tetrahydro-pyridine-3-car...)
Affinity DataIC50:  115nM. Assay description: Displacement of [3H]NMS binding to human Muscarinic acetylcholine receptor M5 using membranes from transfected CHO cells
In DepthDetails ArticlePubMed
TargetMuscarinic acetylcholine receptor M2(Homo sapiens (Human))
Warner-Lambert
Curated by ChEMBL
LigandPNGBDBM50073454(1-Ethyl-4-phenyl-1,2,5,6-tetrahydro-pyridine-3-car...)
Affinity DataIC50:  565nM. Assay description: Displacement of [3H]NMS binding to human Muscarinic acetylcholine receptor M2 using membranes from transfected CHO cells
In DepthDetails ArticlePubMed
TargetMuscarinic acetylcholine receptor M1(Homo sapiens (Human))
Warner-Lambert
Curated by ChEMBL
LigandPNGBDBM50073454(1-Ethyl-4-phenyl-1,2,5,6-tetrahydro-pyridine-3-car...)
Affinity DataIC50:  15nM. Assay description: Displacement of [3H]NMS binding to human Muscarinic acetylcholine receptor M1 using membranes from transfected CHO cells
In DepthDetails ArticlePubMed