BDBM50073480 1-Ethyl-4-phenyl-1,2,3,6-tetrahydro-pyridine-3-carboxylic acid 5-phenyl-pentyl ester; oxalic acid::CHEMBL334093
SMILES CCN1CC=C(C(C1)C(=O)OCCCCCc1ccccc1)c1ccccc1
InChI Key InChIKey=KITIUYQFZPHNEQ-UHFFFAOYSA-N
Data  5 IC50
  Tab Delimited (TSV)   2D SDfile   Computed 3D by Vconf -m prep SDfile
Find this compound or compounds like it in BindingDB:
Activity Spreadsheet -- Enzyme Inhibition Constant Data from BindingDB
Found 5 hits for monomerid = 50073480
TargetMuscarinic acetylcholine receptor M2(Homo sapiens (Human))
Warner-Lambert
Curated by ChEMBL
LigandPNGBDBM50073480(1-Ethyl-4-phenyl-1,2,3,6-tetrahydro-pyridine-3-car...)
Affinity DataIC50:  661nM. Assay description: Displacement of [3H]NMS binding to human Muscarinic acetylcholine receptor M2 using membranes from transfected CHO cells
In DepthDetails ArticlePubMed
TargetMuscarinic acetylcholine receptor M1(Homo sapiens (Human))
Warner-Lambert
Curated by ChEMBL
LigandPNGBDBM50073480(1-Ethyl-4-phenyl-1,2,3,6-tetrahydro-pyridine-3-car...)
Affinity DataIC50:  670nM. Assay description: Displacement of [3H]NMS binding to human Muscarinic acetylcholine receptor M1 using membranes from transfected CHO cells
In DepthDetails ArticlePubMed
TargetMuscarinic acetylcholine receptor M5(Homo sapiens (Human))
Warner-Lambert
Curated by ChEMBL
LigandPNGBDBM50073480(1-Ethyl-4-phenyl-1,2,3,6-tetrahydro-pyridine-3-car...)
Affinity DataIC50:  1.57E+3nM. Assay description: Displacement of [3H]NMS binding to human Muscarinic acetylcholine receptor M5 using membranes from transfected CHO cells
In DepthDetails ArticlePubMed
TargetMuscarinic acetylcholine receptor M3(Homo sapiens (Human))
Warner-Lambert
Curated by ChEMBL
LigandPNGBDBM50073480(1-Ethyl-4-phenyl-1,2,3,6-tetrahydro-pyridine-3-car...)
Affinity DataIC50:  2.05E+3nM. Assay description: Displacement of [3H]-NMS binding to human Muscarinic acetylcholine receptor M3 using membranes from transfected CHO cells
In DepthDetails ArticlePubMed
TargetMuscarinic acetylcholine receptor M4(Homo sapiens (Human))
Warner-Lambert
Curated by ChEMBL
LigandPNGBDBM50073480(1-Ethyl-4-phenyl-1,2,3,6-tetrahydro-pyridine-3-car...)
Affinity DataIC50:  2.39E+3nM. Assay description: Displacement of [3H]NMS binding to human Muscarinic acetylcholine receptor M4 using membranes from transfected CHO cells
In DepthDetails ArticlePubMed