BDBM50073559 1-[4-(4-Amino-6,7-dimethoxy-quinazolin-2-yl)-piperazin-1-yl]-2-(2-isopropyl-6-methoxy-phenoxy)-propan-1-one::CHEMBL136458
SMILES COc1cc2nc(nc(N)c2cc1OC)N1CCN(CC1)C(=O)C(C)Oc1c(OC)cccc1C(C)C
InChI Key InChIKey=XLJAXHKXAQXROY-UHFFFAOYSA-N
Data  3 KI  3 IC50
  Tab Delimited (TSV)   2D SDfile   Computed 3D by Vconf -m prep SDfile
Find this compound or compounds like it in BindingDB:
Activity Spreadsheet -- Enzyme Inhibition Constant Data from BindingDB
Found 6 hits for monomerid = 50073559
TargetAlpha-1B adrenergic receptor(Homo sapiens (Human))
Recordati
Curated by ChEMBL
LigandPNGBDBM50073559(1-[4-(4-Amino-6,7-dimethoxy-quinazolin-2-yl)-piper...)
Affinity DataKi:  14.7nM. Assay description: The binding affinity of the compound was determined towards Alpha-1B adrenergic receptor in the COS cell line.
In DepthDetails ArticlePubMed
TargetAlpha-1A adrenergic receptor(Rattus norvegicus (Rat))
Recordati
Curated by ChEMBL
LigandPNGBDBM50073559(1-[4-(4-Amino-6,7-dimethoxy-quinazolin-2-yl)-piper...)
Affinity DataKi:  156nM. Assay description: The binding affinity of the compound was determined towards Alpha-1A adrenergic receptor in the COS cell line.
In DepthDetails ArticlePubMed
TargetAlpha-1A adrenergic receptor(Homo sapiens (Human))
Recordati
Curated by ChEMBL
LigandPNGBDBM50073559(1-[4-(4-Amino-6,7-dimethoxy-quinazolin-2-yl)-piper...)
Affinity DataKi:  1.11E+3nM. Assay description: The binding affinity of the compound was determined towards Alpha-1C adrenergic receptor in the COS cell line.
In DepthDetails ArticlePubMed
Target5-hydroxytryptamine receptor 1A(Rattus norvegicus (rat))
Recordati
Curated by ChEMBL
LigandPNGBDBM50073559(1-[4-(4-Amino-6,7-dimethoxy-quinazolin-2-yl)-piper...)
Affinity DataIC50: >1.00E+3nM. Assay description: Inhibitory concentration against 5-hydroxytryptamine 1A receptor (Inactive at >1000 nM concentration)
In DepthDetails ArticlePubMed
Target5-hydroxytryptamine receptor 2A(Rattus norvegicus (rat))
Recordati
Curated by ChEMBL
LigandPNGBDBM50073559(1-[4-(4-Amino-6,7-dimethoxy-quinazolin-2-yl)-piper...)
Affinity DataIC50: >1.00E+3nM. Assay description: Inhibitory concentration against 5-hydroxytryptamine 2A receptor (Inactive at >1000 nM concentration)
In DepthDetails ArticlePubMed
TargetD(2) dopamine receptor(Rattus norvegicus (rat))
Recordati
Curated by ChEMBL
LigandPNGBDBM50073559(1-[4-(4-Amino-6,7-dimethoxy-quinazolin-2-yl)-piper...)
Affinity DataIC50: >1.00E+3nM. Assay description: Inhibitory concentration against Dopamine receptor D2 (Inactive at >1000 nM concentration)
In DepthDetails ArticlePubMed