BDBM50073625 (Z)-3-(3,4-Dihydroxy-phenyl)-acrylic acid 2-[(Z)-3-(3,4-dihydroxy-phenyl)-acryloyloxy]-cyclohexyl ester::CHEMBL149305
SMILES Oc1ccc(\C=C/C(=O)OC2CCCCC2OC(=O)\C=C/c2ccc(O)c(O)c2)cc1O
InChI Key InChIKey=ABRIKWKVYABQBU-OXAWKVHCSA-N
Data  1 IC50
  Tab Delimited (TSV)   2D SDfile   Computed 3D by Vconf -m prep SDfile
Find this compound or compounds like it in BindingDB:
Activity Spreadsheet -- Enzyme Inhibition Constant Data from BindingDB
Found 1 hit for monomerid = 50073625
TargetIntegrase(Human immunodeficiency virus 1)
University Of California
Curated by ChEMBL
LigandPNGBDBM50073625((Z)-3-(3,4-Dihydroxy-phenyl)-acrylic acid 2-[(Z)-3...)
Affinity DataIC50:  8.36E+3nM. Assay description: Inhibitory activity against Human Immunodeficiency Virus Type 1 integrase (HIV-1 IN) in the disintegration assay.
In DepthDetails ArticlePubMed