BDBM50073634 2,3-Bis-(3,4,5-trihydroxy-benzoyloxy)-succinic acid::CHEMBL357646
SMILES OC(=O)C(OC(=O)c1cc(O)c(O)c(O)c1)C(OC(=O)c1cc(O)c(O)c(O)c1)C(O)=O
InChI Key InChIKey=ISFQIUFDHRENTK-UHFFFAOYSA-N
Data  1 IC50
  Tab Delimited (TSV)   2D SDfile   Computed 3D by Vconf -m prep SDfile
Find this compound or compounds like it in BindingDB:
Activity Spreadsheet -- Enzyme Inhibition Constant Data from BindingDB
Found 1 hit for monomerid = 50073634
TargetIntegrase(Human immunodeficiency virus 1)
University Of California
Curated by ChEMBL
LigandPNGBDBM50073634(2,3-Bis-(3,4,5-trihydroxy-benzoyloxy)-succinic aci...)
Affinity DataIC50:  970nM. Assay description: Inhibitory activity against Human Immunodeficiency Virus Type 1 integrase (HIV-1 IN) in the disintegration assay.
In DepthDetails ArticlePubMed