BDBM50073659 CHEMBL3409220
SMILES Oc1ccc(CCN=C=S)cc1O
InChI Key InChIKey=PCQBHPIKVHRODR-UHFFFAOYSA-N
Data  2 IC50
  Tab Delimited (TSV)   2D SDfile   Computed 3D by Vconf -m prep SDfile
Find this compound or compounds like it in BindingDB:
Activity Spreadsheet -- Enzyme Inhibition Constant Data from BindingDB
Found 2 hits for monomerid = 50073659
TargetMacrophage migration inhibitory factor(Homo sapiens (Human))
University Of Otago
Curated by ChEMBL
LigandPNGBDBM50073659(CHEMBL3409220)
Affinity DataIC50:  4.00E+3nM. Assay description: Inhibition of macrophage migration inhibitory factor tautomerase activity in human Jurkat T cells using L-dopachrome methyl ester as substrate incuba...
In DepthDetails ArticlePubMed
TargetMacrophage migration inhibitory factor(Homo sapiens (Human))
University Of Otago
Curated by ChEMBL
LigandPNGBDBM50073659(CHEMBL3409220)
Affinity DataIC50:  2.90E+4nM. Assay description: Inhibition of human recombinant macrophage migration inhibitory factor tautomerase activity expressed in Escherichia coli DH5alpha using L-dopachrome...
In DepthDetails ArticlePubMed