BDBM50073720 (S)-3-[((2S,5S,11bR)-2-Benzyloxycarbonylamino-3-oxo-2,3,5,6,11,11b-hexahydro-1H-indolizino[8,7-b]indole-5-carbonyl)-amino]-4-phenyl-butyric acid 2-trimethylsilanyl-ethyl ester::CHEMBL358334
SMILES C[Si](C)(C)CCOC(=O)C[C@H](Cc1ccccc1)NC(=O)[C@@H]1Cc2c([nH]c3ccccc23)[C@H]2C[C@H](NC(=O)OCc3ccccc3)C(=O)N12
InChI Key InChIKey=XMDVFPVALIMTTG-PVVDWXEZSA-N
Data  2 IC50
  Tab Delimited (TSV)   2D SDfile   Computed 3D by Vconf -m prep SDfile
Find this compound or compounds like it in BindingDB:
Activity Spreadsheet -- Enzyme Inhibition Constant Data from BindingDB
Found 2 hits for monomerid = 50073720
TargetCholecystokinin receptor type A(RAT)
Instituto De QuíMica MéDica (Csic)
Curated by ChEMBL
LigandPNGBDBM50073720((S)-3-[((2S,5S,11bR)-2-Benzyloxycarbonylamino-3-ox...)
Affinity DataIC50:  220nM. Assay description: Inhibition of [3H]-propionyl-CCK-8 binding to rat pancreas cholecystokinin-A (CCK-A) receptor
In DepthDetails ArticlePubMed
TargetGastrin/cholecystokinin type B receptor(MOUSE)
Instituto De QuíMica MéDica (Csic)
Curated by ChEMBL
LigandPNGBDBM50073720((S)-3-[((2S,5S,11bR)-2-Benzyloxycarbonylamino-3-ox...)
Affinity DataIC50:  2.40E+3nM. Assay description: Inhibition of [3H]-propionyl-CCK-8 binding to mouse cerebral cortex membrane cholecystokinin-B (CCK-B) receptor
In DepthDetails ArticlePubMed