BDBM50073784 CHEMBL366642::N*2*-(4-Amino-cyclohexyl)-9-ethyl-N*6*-(3-fluoro-phenyl)-9H-purine-2,6-diamine
SMILES CCn1cnc2c(Nc3cccc(F)c3)nc(N[C@H]3CC[C@H](N)CC3)nc12
InChI Key InChIKey=WKESGRBZSRGRRG-HDJSIYSDSA-N
Data  1 IC50
  Tab Delimited (TSV)   2D SDfile   Computed 3D by Vconf -m prep SDfile
Find this compound or compounds like it in BindingDB:
Activity Spreadsheet -- Enzyme Inhibition Constant Data from BindingDB
Found 1 hit for monomerid = 50073784
TargetCyclin-dependent kinase 1(Homo sapiens (Human))
Novartis Pharmaceuticals
Curated by ChEMBL
LigandPNGBDBM50073784(CHEMBL366642 | N*2*-(4-Amino-cyclohexyl)-9-ethyl-N...)
Affinity DataIC50:  150nM. Assay description: Inhibitory activity against cyclin-dependent kinase 1 (CDK1) was determined
In DepthDetails ArticlePubMed