BDBM50073828 Benzyl-[2-((R)-2,2-dimethyl-1-methylcarbamoyl-propylcarbamoyl)-4-phenyl-butyl]-phosphinic acid::CHEMBL27647
SMILES CNC(=O)[C@H](NC(=O)C(CCc1ccccc1)CP(O)(=O)Cc1ccccc1)C(C)(C)C
InChI Key InChIKey=ROFAQOFULLWONA-KEKNWZKVSA-N
Data  3 IC50
  Tab Delimited (TSV)   2D SDfile   Computed 3D by Vconf -m prep SDfile
Find this compound or compounds like it in BindingDB:
Activity Spreadsheet -- Enzyme Inhibition Constant Data from BindingDB
Found 3 hits for monomerid = 50073828
TargetInterstitial collagenase(Homo sapiens (Human))
Pfizer
Curated by ChEMBL
LigandPNGBDBM50073828(Benzyl-[2-((R)-2,2-dimethyl-1-methylcarbamoyl-prop...)
Affinity DataIC50:  2.20E+4nM. Assay description: Inhibitory activity against recombinant matrix metalloprotease-1 (MMP-1).
In DepthDetails ArticlePubMed
TargetStromelysin-1(Homo sapiens (Human))
Pfizer
Curated by ChEMBL
LigandPNGBDBM50073828(Benzyl-[2-((R)-2,2-dimethyl-1-methylcarbamoyl-prop...)
Affinity DataIC50:  2.70E+3nM. Assay description: Inhibition of recombinant matrix metalloprotease-3 (MMP-3)
In DepthDetails ArticlePubMed
TargetCollagenase 3(Homo sapiens (Human))
Pfizer
Curated by ChEMBL
LigandPNGBDBM50073828(Benzyl-[2-((R)-2,2-dimethyl-1-methylcarbamoyl-prop...)
Affinity DataIC50:  300nM. Assay description: Inhibition of recombinant Matrix metalloproteinase-13 (MMP-13)
In DepthDetails ArticlePubMed