BDBM50074023 CHEMBL153469::N-Hydroxy-3-(4-methoxy-benzenesulfonyl)-4-phenyl-butyramide
SMILES COc1ccc(cc1)S(=O)(=O)C(CC(=O)NO)Cc1ccccc1
InChI Key InChIKey=AFJPLWPNTPTDED-UHFFFAOYSA-N
Data  3 KI
  Tab Delimited (TSV)   2D SDfile   Computed 3D by Vconf -m prep SDfile
Find this compound or compounds like it in BindingDB:
Activity Spreadsheet -- Enzyme Inhibition Constant Data from BindingDB
Found 3 hits for monomerid = 50074023
Target72 kDa type IV collagenase(Homo sapiens (Human))
RhôNe-Poulenc Rorer
Curated by ChEMBL
LigandPNGBDBM50074023(CHEMBL153469 | N-Hydroxy-3-(4-methoxy-benzenesulfo...)
Affinity DataKi:  20nM. Assay description: Inhibition of matrix metalloproteinase-2 (MMP-2), gelatinase-A
In DepthDetails ArticlePubMed
TargetStromelysin-1(Homo sapiens (Human))
RhôNe-Poulenc Rorer
Curated by ChEMBL
LigandPNGBDBM50074023(CHEMBL153469 | N-Hydroxy-3-(4-methoxy-benzenesulfo...)
Affinity DataKi:  300nM. Assay description: Inhibition of matrix metalloproteinase-3 (MMP-3), stromelysin-1
In DepthDetails ArticlePubMed
TargetInterstitial collagenase(Homo sapiens (Human))
RhôNe-Poulenc Rorer
Curated by ChEMBL
LigandPNGBDBM50074023(CHEMBL153469 | N-Hydroxy-3-(4-methoxy-benzenesulfo...)
Affinity DataKi:  1.00E+3nM. Assay description: Inhibition of matrix metalloproteinase-1 (MMP-1), fibroblast collagenase.
In DepthDetails ArticlePubMed