BDBM50074567 Bis-{4-{[3-(1,3-Dioxo-1,3-dihydro-isoindol-2-yl)-propoxyimino]-methyl}-1-ethyl-pyridinium}dibromide::CHEMBL354103
SMILES O=C1N(CCCO\N=C\c2cc[n+](CCCCC[n+]3ccc(\C=N\OCCCN4C(=O)c5ccccc5C4=O)cc3)cc2)C(=O)c2ccccc12
InChI Key InChIKey=AUKQNOJPVLYMFE-ICKILNQYSA-N
Data  1 EC50
  Tab Delimited (TSV)   2D SDfile   Computed 3D by Vconf -m prep SDfile
Find this compound or compounds like it in BindingDB:
Activity Spreadsheet -- Enzyme Inhibition Constant Data from BindingDB
Found 1 hit for monomerid = 50074567
TargetMuscarinic acetylcholine receptor M2(GUINEA PIG)
University Of Bonn
Curated by ChEMBL
LigandPNGBDBM50074567(Bis-{4-{[3-(1,3-Dioxo-1,3-dihydro-isoindol-2-yl)-p...)
Affinity DataEC50:  510nM. Assay description: Allosteric potency against the dissociation of radioligand [3H]-N-methylscopolamine from the porcine cardiac Muscarinic acetylcholine receptor M2
In DepthDetails ArticlePubMed