BDBM50074631 4-[2-(6-Phenyl-hex-1-ynyl)-cyclopropyl]-1H-imidazole::CHEMBL170505
SMILES C(CCc1ccccc1)CC#CC1CC1c1cnc[nH]1
InChI Key InChIKey=FIPDHFMNUIGIFM-UHFFFAOYSA-N
Data  1 KI
  Tab Delimited (TSV)   2D SDfile   Computed 3D by Vconf -m prep SDfile
Find this compound or compounds like it in BindingDB:
Activity Spreadsheet -- Enzyme Inhibition Constant Data from BindingDB
Found 1 hit for monomerid = 50074631
TargetHistamine H3 receptor(Rattus norvegicus (rat))
Gliatech
Curated by ChEMBL
LigandPNGBDBM50074631(4-[2-(6-Phenyl-hex-1-ynyl)-cyclopropyl]-1H-imidazo...)
Affinity DataKi:  15.9nM. Assay description: Binding affinity at histamine H3 receptor in rat cortical membranes by [3H]-Nalpha-methylhistamine displacement.
In DepthDetails ArticlePubMed