BDBM50074680 2-p-Tolylsulfanylcarbonylamino-pentanedioic acid::CHEMBL172027
SMILES Cc1ccc(SC(=O)NC(CCC(O)=O)C(O)=O)cc1
InChI Key InChIKey=ASPMVRDUGVULQL-UHFFFAOYSA-N
Data  1 KI
  Tab Delimited (TSV)   2D SDfile   Computed 3D by Vconf -m prep SDfile
Find this compound or compounds like it in BindingDB:
Activity Spreadsheet -- Enzyme Inhibition Constant Data from BindingDB
Found 1 hit for monomerid = 50074680
TargetCarboxypeptidase G2(Pseudomonas aeruginosa)
Imperial College
Curated by ChEMBL
LigandPNGBDBM50074680(2-p-Tolylsulfanylcarbonylamino-pentanedioic acid |...)
Affinity DataKi:  1.05E+3nM. Assay description: Inhibitory activity against bacterial carboxypeptidase G2 by Dixon plot assay
In DepthDetails ArticlePubMed