BDBM50074746 3-(3-Chloro-phenyl)-5,7-dimethoxy-chromen-4-one::CHEMBL7981
SMILES COc1cc(OC)c2c(c1)occ(-c1cccc(Cl)c1)c2=O
InChI Key InChIKey=USNKYQXLHXAMIJ-UHFFFAOYSA-N
Data  4 IC50
  Tab Delimited (TSV)   2D SDfile   Computed 3D by Vconf -m prep SDfile
Find this compound or compounds like it in BindingDB:
Activity Spreadsheet -- Enzyme Inhibition Constant Data from BindingDB
Found 4 hits for monomerid = 50074746
TargetPlatelet-derived growth factor receptor alpha/beta(Homo sapiens (Human))
Novartis
Curated by ChEMBL
LigandPNGBDBM50074746(3-(3-Chloro-phenyl)-5,7-dimethoxy-chromen-4-one | ...)
Affinity DataIC50: >1.00E+4nM. Assay description: Inhibition of Platelet-derived growth factor receptor-dependent phosphorylation
In DepthDetails ArticlePubMed
TargetEpidermal growth factor receptor(Mus musculus)
Novartis
Curated by ChEMBL
LigandPNGBDBM50074746(3-(3-Chloro-phenyl)-5,7-dimethoxy-chromen-4-one | ...)
Affinity DataIC50:  4.62E+4nM. Assay description: Inhibition of EGF-dependent mouse keratinocyte MK cell proliferation
In DepthDetails ArticlePubMed
TargetEpidermal growth factor receptor(Homo sapiens (Human))
Novartis
Curated by ChEMBL
LigandPNGBDBM50074746(3-(3-Chloro-phenyl)-5,7-dimethoxy-chromen-4-one | ...)
Affinity DataIC50: >1.00E+5nM. Assay description: Inhibition of Epidermal growth factor receptor-dependent phosphorylation
In DepthDetails ArticlePubMed
TargetEpidermal growth factor receptor(Homo sapiens (Human))
Novartis
Curated by ChEMBL
LigandPNGBDBM50074746(3-(3-Chloro-phenyl)-5,7-dimethoxy-chromen-4-one | ...)
Affinity DataIC50:  5.00E+5nM. Assay description: Inhibition of Epidermal growth factor receptor
In DepthDetails ArticlePubMed