BDBM50075322 2-(2,6-Dimethyl-phenyl)-4-hydroxy-isoindole-1,3-dione::CHEMBL277841
SMILES Cc1cccc(C)c1N1C(=O)c2cccc(O)c2C1=O
InChI Key InChIKey=BWFPKYOYFYEJGJ-UHFFFAOYSA-N
Data  5 IC50
  Tab Delimited (TSV)   2D SDfile   Computed 3D by Vconf -m prep SDfile
Find this compound or compounds like it in BindingDB:
Activity Spreadsheet -- Enzyme Inhibition Constant Data from BindingDB
Found 5 hits for monomerid = 50075322
TargetAminopeptidase N(Homo sapiens (Human))
University Of Tokyo
Curated by ChEMBL
LigandPNGBDBM50075322(2-(2,6-Dimethyl-phenyl)-4-hydroxy-isoindole-1,3-di...)
Affinity DataIC50:  2.64E+5nM. Assay description: Inhibitory activity against aminopeptidase N (APN) in human acute lymphoblastic leukemia MOLT-4 cell line
In DepthDetails ArticlePubMed
TargetDipeptidyl peptidase 4(Homo sapiens (Human))
University Of Tokyo
Curated by ChEMBL
LigandPNGBDBM50075322(2-(2,6-Dimethyl-phenyl)-4-hydroxy-isoindole-1,3-di...)
Affinity DataIC50: >3.74E+5nM. Assay description: Inhibitory activity against Dipeptidylpeptidase IV (DPP IV) in human acute lymphoblastic leukemia MOLT-4 cell line
In DepthDetails ArticlePubMed
TargetAminopeptidase N(Homo sapiens (Human))
University Of Tokyo
Curated by ChEMBL
LigandPNGBDBM50075322(2-(2,6-Dimethyl-phenyl)-4-hydroxy-isoindole-1,3-di...)
Affinity DataIC50:  2.65E+5nM. Assay description: Inhibitory activity against aminopeptidase N assayed by the L-Ala-MCA method.
In DepthDetails ArticlePubMed
TargetDipeptidyl peptidase 4(Homo sapiens (Human))
University Of Tokyo
Curated by ChEMBL
LigandPNGBDBM50075322(2-(2,6-Dimethyl-phenyl)-4-hydroxy-isoindole-1,3-di...)
Affinity DataIC50: >3.74E+5nM. Assay description: Inhibitory activity against Dipeptidylpeptidase IV (DPP IV) in human acute lymphoblastic leukemia MOLT-4 cell line
In DepthDetails ArticlePubMed
TargetAminopeptidase N(Homo sapiens (Human))
University Of Tokyo
Curated by ChEMBL
LigandPNGBDBM50075322(2-(2,6-Dimethyl-phenyl)-4-hydroxy-isoindole-1,3-di...)
Affinity DataIC50:  2.65E+5nM. Assay description: Inhibitory activity against aminopeptidase N (APN) in human acute lymphoblastic leukemia MOLT-4 cell line
In DepthDetails ArticlePubMed