BDBM50075609 (E)-(S)-4-((2R,5S)-2-Benzyl-5-benzylsulfanylcarbonylamino-7-methyl-4-oxo-octanoylamino)-6-carbamoyl-hex-2-enoic acid ethyl ester::CHEMBL20174
SMILES CCOC(=O)\C=C\[C@H](CCC(N)=O)NC(=O)[C@@H](CC(=O)[C@H](CC(C)C)NC(=O)SCc1ccccc1)Cc1ccccc1
InChI Key InChIKey=GFCDJOSRIBJPPT-AKBJHRGISA-N
Data  1 EC50
  Tab Delimited (TSV)   2D SDfile   Computed 3D by Vconf -m prep SDfile
Find this compound or compounds like it in BindingDB:
Activity Spreadsheet -- Enzyme Inhibition Constant Data from BindingDB
Found 1 hit for monomerid = 50075609
TargetGenome polyprotein(Human rhinovirus B)
Agouron Pharmaceuticals
Curated by ChEMBL
LigandPNGBDBM50075609((E)-(S)-4-((2R,5S)-2-Benzyl-5-benzylsulfanylcarbon...)
Affinity DataEC50:  680nM. Assay description: Increased percentage of formazan production in drug treated virus infected cells to equal 50% of control drug free uninfected cells on serotype 14
In DepthDetails ArticlePubMed