BDBM50075811 3-(4-{3-[2-Phenoxymethyl-4-(3-piperidin-1-yl-propoxy)-benzoimidazol-1-yl]-propyl}-piperidin-1-yl)-1-phenyl-propan-1-one::CHEMBL347807
SMILES O=C(CCN1CCC(CCCn2c(COc3ccccc3)nc3c(OCCCN4CCCCC4)cccc23)CC1)c1ccccc1
InChI Key InChIKey=JKLHZMSMCPAPNY-UHFFFAOYSA-N
Data  1 KI
  Tab Delimited (TSV)   2D SDfile   Computed 3D by Vconf -m prep SDfile
Find this compound or compounds like it in BindingDB:
Activity Spreadsheet -- Enzyme Inhibition Constant Data from BindingDB
Found 1 hit for monomerid = 50075811
TargetNeuropeptide Y receptor type 1(Homo sapiens (Human))
Eli Lilly
Curated by ChEMBL
LigandPNGBDBM50075811(3-(4-{3-[2-Phenoxymethyl-4-(3-piperidin-1-yl-propo...)
Affinity DataKi:  0.112nM. Assay description: Ability to displace [125I]-peptide YY binding to cloned human Neuropeptide Y receptor type 1 expressed in AV-12 cells
In DepthDetails ArticlePubMed