BDBM50075915 CHEMBL79675::N-{4-[2-((R)-2-Hydroxy-2-pyridin-3-yl-ethylamino)-ethyl]-phenyl}-4-[2-oxo-3-(4,4,4-trifluoro-butyl)-imidazolidin-1-yl]-benzenesulfonamide::N-{4-[2-(2-Hydroxy-2-pyridin-3-yl-ethylamino)-ethyl]-phenyl}-4-[2-oxo-3-(4,4,4-trifluoro-butyl)-imidazolidin-1-yl]-benzenesulfonamide
SMILES O[C@@H](CNCCc1ccc(NS(=O)(=O)c2ccc(cc2)N2CCN(CCCC(F)(F)F)C2=O)cc1)c1cccnc1
InChI Key InChIKey=YAWRIOMDGOIDPB-SANMLTNESA-N
Data  2 IC50  3 EC50
  Tab Delimited (TSV)   2D SDfile   Computed 3D by Vconf -m prep SDfile
Find this compound or compounds like it in BindingDB:
Activity Spreadsheet -- Enzyme Inhibition Constant Data from BindingDB
Found 5 hits for monomerid = 50075915
TargetBeta-2 adrenergic receptor(Homo sapiens (Human))
Merck Research Laboratories
Curated by ChEMBL
LigandPNGBDBM50075915(CHEMBL79675 | N-{4-[2-((R)-2-Hydroxy-2-pyridin-3-y...)
Affinity DataIC50:  6.50E+3nM. Assay description: Binding affinity towards human Beta-2 adrenergic receptor expressed in CHO cells, using [125I]-iodocyanopindolol
In DepthDetails ArticlePubMed
TargetBeta-1 adrenergic receptor(Homo sapiens (Human))
Merck Research Laboratories
Curated by ChEMBL
LigandPNGBDBM50075915(CHEMBL79675 | N-{4-[2-((R)-2-Hydroxy-2-pyridin-3-y...)
Affinity DataIC50:  1.00E+4nM. Assay description: Binding affinity towards human Beta-1 adrenergic receptor expressed in CHO cells, using 1251-iodocyanopindolol
In DepthDetails ArticlePubMed
TargetBeta-3 adrenergic receptor(Homo sapiens (Human))
Central Drug Research Institute
Curated by ChEMBL
LigandPNGBDBM50075915(CHEMBL79675 | N-{4-[2-((R)-2-Hydroxy-2-pyridin-3-y...)
Affinity DataEC50:  5.50E+7nM. Assay description: In vitro effective concentration against beta-3 adrenergic receptor.
In DepthDetails ArticlePubMed
TargetBeta-3 adrenergic receptor(Homo sapiens (Human))
Central Drug Research Institute
Curated by ChEMBL
LigandPNGBDBM50075915(CHEMBL79675 | N-{4-[2-((R)-2-Hydroxy-2-pyridin-3-y...)
Affinity DataEC50:  18nM. Assay description: In vitro effective concentration against beta-3 adrenergic receptor.
In DepthDetails ArticlePubMed
TargetBeta-3 adrenergic receptor(Homo sapiens (Human))
Central Drug Research Institute
Curated by ChEMBL
LigandPNGBDBM50075915(CHEMBL79675 | N-{4-[2-((R)-2-Hydroxy-2-pyridin-3-y...)
Affinity DataEC50:  18nM. Assay description: Agonist activity towards Beta-3 adrenergic receptor
In DepthDetails ArticlePubMed