BDBM50076028 CHEMBL424575::N-((3S,4S)-1-Benzyl-4-propyl-pyrrolidin-3-ylmethyl)-5-chloro-2-methoxy-4-methylamino-benzamide
SMILES CCC[C@@H]1CN(Cc2ccccc2)C[C@@H]1CNC(=O)c1cc(Cl)c(NC)cc1OC
InChI Key InChIKey=FPHFICIJDHPAHE-MOPGFXCFSA-N
Data  5 KI
  Tab Delimited (TSV)   2D SDfile   Computed 3D by Vconf -m prep SDfile
Find this compound or compounds like it in BindingDB:
Activity Spreadsheet -- Enzyme Inhibition Constant Data from BindingDB
Found 5 hits for monomerid = 50076028
TargetD(3) dopamine receptor(Homo sapiens (Human))
Universit£T Erlangen-N£Rnberg
Curated by ChEMBL
LigandPNGBDBM50076028(CHEMBL424575 | N-((3S,4S)-1-Benzyl-4-propyl-pyrrol...)
Affinity DataKi:  31nM. Assay description: Binding affinity towards human dopamine D3 receptor by [3H]spiperone displacement.
In DepthDetails ArticlePubMed
TargetD(2) dopamine receptor(Homo sapiens (Human))
Universit£T Erlangen-N£Rnberg
Curated by ChEMBL
LigandPNGBDBM50076028(CHEMBL424575 | N-((3S,4S)-1-Benzyl-4-propyl-pyrrol...)
Affinity DataKi:  190nM. Assay description: Binding affinity towards human Dopamine receptor D2 (long) by [3H]-spiperone displacement.
In DepthDetails ArticlePubMed
TargetD(2) dopamine receptor(Homo sapiens (Human))
Universit£T Erlangen-N£Rnberg
Curated by ChEMBL
LigandPNGBDBM50076028(CHEMBL424575 | N-((3S,4S)-1-Benzyl-4-propyl-pyrrol...)
Affinity DataKi:  190nM. Assay description: Binding affinity towards human Dopamine receptor D2 (short) by [3H]-spiperone displacement.
In DepthDetails ArticlePubMed
TargetD(4) dopamine receptor(Homo sapiens (Human))
Universit£T Erlangen-N£Rnberg
Curated by ChEMBL
LigandPNGBDBM50076028(CHEMBL424575 | N-((3S,4S)-1-Benzyl-4-propyl-pyrrol...)
Affinity DataKi:  200nM. Assay description: Binding affinity towards human Dopamine receptor D4 by [3H]spiperone displacement.
In DepthDetails ArticlePubMed
TargetD(1A) dopamine receptor(BOVINE)
Universit£T Erlangen-N£Rnberg
Curated by ChEMBL
LigandPNGBDBM50076028(CHEMBL424575 | N-((3S,4S)-1-Benzyl-4-propyl-pyrrol...)
Affinity DataKi:  2.80E+3nM. Assay description: Binding affinity towards bovine dopamine D1 receptor by [3H]-SCH- 23390 displacement.
In DepthDetails ArticlePubMed