BDBM50076078 (3S,3aR,4R,4aS,8aR,9aS)-4-[3-(3,5-Dimethyl-piperazin-1-yl)-propyl]-3-methyl-decahydro-naphtho[2,3-c]furan-1-one::CHEMBL423438
SMILES C[C@@H]1OC(=O)[C@H]2C[C@H]3CCCC[C@@H]3[C@@H](CCCN3CC(C)NC(C)C3)[C@@H]12
InChI Key InChIKey=YNLMVLOZEASXEZ-NQFQZQQSSA-N
Data  2 KI
  Tab Delimited (TSV)   2D SDfile   Computed 3D by Vconf -m prep SDfile
Find this compound or compounds like it in BindingDB:
Activity Spreadsheet -- Enzyme Inhibition Constant Data from BindingDB
Found 2 hits for monomerid = 50076078
TargetMuscarinic acetylcholine receptor M2(Homo sapiens (Human))
Schering-Plough Research Institute
Curated by ChEMBL
LigandPNGBDBM50076078((3S,3aR,4R,4aS,8aR,9aS)-4-[3-(3,5-Dimethyl-piperaz...)
Affinity DataKi: >500nM. Assay description: Binding affinity towards human muscarinic M2 receptor in CHO-KI cells using [3H]- QNB as radioligand
In DepthDetails ArticlePubMed
TargetMuscarinic acetylcholine receptor M1(Homo sapiens (Human))
Schering-Plough Research Institute
Curated by ChEMBL
LigandPNGBDBM50076078((3S,3aR,4R,4aS,8aR,9aS)-4-[3-(3,5-Dimethyl-piperaz...)
Affinity DataKi:  1.36E+3nM. Assay description: Binding affinity towards human muscarinic M1 receptor in CHO-KI cells using [3H]- QNB as radioligand
In DepthDetails ArticlePubMed