BDBM50076220 (1S,7S)-7-Amino-7-benzyl-hexahydro-pyrazolo[1,2-a]pyridazine-1-carboxylic acid ((S)-1-chloromethyl-4-guanidino-butyl)-amide::CHEMBL284436
SMILES NC(=N)NCCC[C@@H](CCl)NC(=O)[C@@H]1CCN2CC[C@@](N)(Cc3ccccc3)CN12
InChI Key InChIKey=JSPAUBUYPPZXSG-BBTUJRGHSA-N
Data  5 KI  1 IC50
  Tab Delimited (TSV)   2D SDfile   Computed 3D by Vconf -m prep SDfile
Find this compound or compounds like it in BindingDB:
Activity Spreadsheet -- Enzyme Inhibition Constant Data from BindingDB
Found 6 hits for monomerid = 50076220
TargetCoagulation factor VII(Homo sapiens (Human))
Molecumetics
Curated by ChEMBL
LigandPNGBDBM50076220((1S,7S)-7-Amino-7-benzyl-hexahydro-pyrazolo[1,2-a]...)
Affinity DataKi:  140nM. Assay description: Inhibitory concentration of the compound against coagulation factor VIIa
In DepthDetails ArticlePubMed
TargetCoagulation factor X(Homo sapiens (Human))
Molecumetics
Curated by ChEMBL
LigandPNGBDBM50076220((1S,7S)-7-Amino-7-benzyl-hexahydro-pyrazolo[1,2-a]...)
Affinity DataKi:  385nM. Assay description: Inhibitory concentration of the compound against Coagulation factor Xa
In DepthDetails ArticlePubMed
TargetTissue-type plasminogen activator(Homo sapiens (Human))
Molecumetics
Curated by ChEMBL
LigandPNGBDBM50076220((1S,7S)-7-Amino-7-benzyl-hexahydro-pyrazolo[1,2-a]...)
Affinity DataKi:  632nM. Assay description: Inhibitory concentration of the compound against Tissue type plasminogen activator
In DepthDetails ArticlePubMed
TargetUrokinase-type plasminogen activator(Homo sapiens (Human))
Molecumetics
Curated by ChEMBL
LigandPNGBDBM50076220((1S,7S)-7-Amino-7-benzyl-hexahydro-pyrazolo[1,2-a]...)
Affinity DataKi:  927nM. Assay description: Inhibitory concentration of the compound against Urokinase-type plasminogen activator
In DepthDetails ArticlePubMed
TargetPlasminogen(Rattus norvegicus)
Molecumetics
Curated by ChEMBL
LigandPNGBDBM50076220((1S,7S)-7-Amino-7-benzyl-hexahydro-pyrazolo[1,2-a]...)
Affinity DataKi:  978nM. Assay description: Inhibitory concentration of the compound against plasmin
In DepthDetails ArticlePubMed
TargetProthrombin(Homo sapiens (Human))
Molecumetics
Curated by ChEMBL
LigandPNGBDBM50076220((1S,7S)-7-Amino-7-benzyl-hexahydro-pyrazolo[1,2-a]...)
Affinity DataIC50:  1.20nM. Assay description: Inhibitory concentration of the compound against thrombin.
In DepthDetails ArticlePubMed