BDBM50076238 CHEMBL3416045
SMILES Cl.CSCCOc1ccc(Cl)cc1[C@H]1C[C@@H]1CN
InChI Key InChIKey=RZOJLCSHYBFEOB-XQKZEKTMSA-N
Data  1 EC50
  Tab Delimited (TSV)   2D SDfile   Computed 3D by Vconf -m prep SDfile
Find this compound or compounds like it in BindingDB:
Activity Spreadsheet -- Enzyme Inhibition Constant Data from BindingDB
Found 1 hit for monomerid = 50076238
Target5-hydroxytryptamine receptor 2C(Homo sapiens (Human))
University Of Illinois At Chicago
Curated by ChEMBL
LigandPNGBDBM50076238(CHEMBL3416045)
Affinity DataEC50:  244nM. Assay description: Agonist activity at human 5-HT2C receptor expressed in HEK293 cells assessed as calcium flux by FLIPR assay
In DepthDetails ArticlePubMed