BDBM50076266 (E)-3-(3,4-Diacetoxy-phenyl)-acrylic acid 3-[(E)-3-(3,4-diacetoxy-phenyl)-acryloyloxy]-propyl ester::CHEMBL31175
SMILES CC(=O)Oc1ccc(\C=C\C(=O)OCCCOC(=O)\C=C\c2ccc(OC(C)=O)c(OC(C)=O)c2)cc1OC(C)=O
InChI Key InChIKey=WUMADTZQXQCLTE-QHKWOANTSA-N
Data  2 IC50
  Tab Delimited (TSV)   2D SDfile   Computed 3D by Vconf -m prep SDfile
Find this compound or compounds like it in BindingDB:
Activity Spreadsheet -- Enzyme Inhibition Constant Data from BindingDB
Found 2 hits for monomerid = 50076266
TargetIntegrase(Human immunodeficiency virus 1)
National Cancer Institute-Bethesda
Curated by ChEMBL
LigandPNGBDBM50076266((E)-3-(3,4-Diacetoxy-phenyl)-acrylic acid 3-[(E)-3...)
Affinity DataIC50: >3.33E+5nM. Assay description: Compound was evaluated for the inhibitory concentration against HIV-1 integrase by radiolabeled oligonucleotide-based assay 3''-processing
In DepthDetails ArticlePubMed
TargetIntegrase(Human immunodeficiency virus 1)
National Cancer Institute-Bethesda
Curated by ChEMBL
LigandPNGBDBM50076266((E)-3-(3,4-Diacetoxy-phenyl)-acrylic acid 3-[(E)-3...)
Affinity DataIC50: >3.33E+5nM. Assay description: Inhibition of HIV-1 integrase by radiolabeled oligonucleotide-based assay integration
In DepthDetails ArticlePubMed