BDBM50076365 1-Benzyl-3-(5-thioxo-4,5-dihydro-[1,3,4]thiadiazol-2-yl)-urea::CHEMBL289587
SMILES Sc1nnc(NC(=O)NCc2ccccc2)s1
InChI Key InChIKey=MZMFSOYMXLYVMZ-UHFFFAOYSA-N
Data  1 KI
  Tab Delimited (TSV)   2D SDfile   Computed 3D by Vconf -m prep SDfile
Find this compound or compounds like it in BindingDB:
Activity Spreadsheet -- Enzyme Inhibition Constant Data from BindingDB
Found 1 hit for monomerid = 50076365
TargetStromelysin-1(Homo sapiens (Human))
Pharmacia And Upjohn
Curated by ChEMBL
LigandPNGBDBM50076365(1-Benzyl-3-(5-thioxo-4,5-dihydro-[1,3,4]thiadiazol...)
Affinity DataKi:  1.60E+4nM. Assay description: Binding affinity for matrix metalloproteinase-3
In DepthDetails ArticlePubMed