BDBM50076393 (1S,2S,3R)-2-((S)-Amino-carboxy-methyl)-3-phenyl-cyclopropanecarboxylic acid::CHEMBL39573
SMILES N[C@@H]([C@@H]1[C@H]([C@@H]1c1ccccc1)C(O)=O)C(O)=O
InChI Key InChIKey=IFLWVSHRWAIVQF-KATARQTJSA-N
Data  2 KI  3 IC50  2 EC50
  Tab Delimited (TSV)   2D SDfile   Computed 3D by Vconf -m prep SDfile
Find this compound or compounds like it in BindingDB:
Activity Spreadsheet -- Enzyme Inhibition Constant Data from BindingDB
Found 7 hits for monomerid = 50076393
TargetMetabotropic glutamate receptor 4(Homo sapiens (Human))
Università
Curated by ChEMBL
LigandPNGBDBM50076393((1S,2S,3R)-2-((S)-Amino-carboxy-methyl)-3-phenyl-c...)
Affinity DataKi:  5.00E+4nM. Assay description: Binding affinity of the compound towards metabotropic glutamate receptor mGluR4a
In DepthDetails ArticlePubMed
TargetMetabotropic glutamate receptor 1(Homo sapiens (Human))
Università
Curated by ChEMBL
LigandPNGBDBM50076393((1S,2S,3R)-2-((S)-Amino-carboxy-methyl)-3-phenyl-c...)
Affinity DataKi: >2.70E+5nM. Assay description: Binding affinity towards metabotropic glutamate receptor mGluR1
In DepthDetails ArticlePubMed
TargetMetabotropic glutamate receptor 4(Homo sapiens (Human))
Università
Curated by ChEMBL
LigandPNGBDBM50076393((1S,2S,3R)-2-((S)-Amino-carboxy-methyl)-3-phenyl-c...)
Affinity DataEC50:  1.56E+5nM. Assay description: Effective concentration of compound against forskolin-stimulated cAMP formation in BHK cells expressing mGluR2 receptor
In DepthDetails ArticlePubMed
TargetMetabotropic glutamate receptor 2(Homo sapiens (Human))
Università
Curated by ChEMBL
LigandPNGBDBM50076393((1S,2S,3R)-2-((S)-Amino-carboxy-methyl)-3-phenyl-c...)
Affinity DataIC50:  8.00E+3nM. Assay description: Concentration required for the half-maximal inhibition of cAMP hydrolysis in BHK cells expressing mGluR2
In DepthDetails ArticlePubMed
TargetMetabotropic glutamate receptor 1(Homo sapiens (Human))
Università
Curated by ChEMBL
LigandPNGBDBM50076393((1S,2S,3R)-2-((S)-Amino-carboxy-methyl)-3-phenyl-c...)
Affinity DataEC50: >3.00E+5nM. Assay description: Concentration required for half-maximal stimulation of PI hydrolysis in BHK cells expressing mGluR1a
In DepthDetails ArticlePubMed
TargetMetabotropic glutamate receptor 1(Homo sapiens (Human))
Università
Curated by ChEMBL
LigandPNGBDBM50076393((1S,2S,3R)-2-((S)-Amino-carboxy-methyl)-3-phenyl-c...)
Affinity DataIC50: >3.00E+5nM. Assay description: Concentration required for the half-maximal inhibition of PI hydrolysis in BHK cells expressing mGluR1a
In DepthDetails ArticlePubMed
TargetMetabotropic glutamate receptor 2(Homo sapiens (Human))
Università
Curated by ChEMBL
LigandPNGBDBM50076393((1S,2S,3R)-2-((S)-Amino-carboxy-methyl)-3-phenyl-c...)
Affinity DataIC50:  9.90E+3nM. Assay description: Inhibitory activity of the compound against Metabotropic glutamate receptor 2 in the rat HEK 293 cells.
In DepthDetails ArticlePubMed