BDBM50076569 (S)-2-Benzyloxycarbonylamino-3-{[5-(4-guanidino-butyl)-4,5-dihydro-isoxazole-3-carbonyl]-amino}-propionic acid::CHEMBL173432
SMILES NC(=N)NCCCCC1CC(=NO1)C(=O)NC[C@H](NC(=O)OCc1ccccc1)C(O)=O
InChI Key InChIKey=QOMCYSFIIXXFGS-WMCAAGNKSA-N
Data  1 IC50
  Tab Delimited (TSV)   2D SDfile   Computed 3D by Vconf -m prep SDfile
Find this compound or compounds like it in BindingDB:
Activity Spreadsheet -- Enzyme Inhibition Constant Data from BindingDB
Found 1 hit for monomerid = 50076569
TargetIntegrin alpha-V/beta-3(Homo sapiens (Human))
Dupont Pharmaceuticals
Curated by ChEMBL
LigandPNGBDBM50076569((S)-2-Benzyloxycarbonylamino-3-{[5-(4-guanidino-bu...)
Affinity DataIC50:  23nM. Assay description: Antagonistic activity against vitronectin receptor
In DepthDetails ArticlePubMed