BDBM50076673 CHEMBL175189::Sodium; (2S,5R,6R)-6-((S)-1-hydroxy-ethyl)-3,3-dimethyl-4,4,7-trioxo-4lambda*6*-thia-1-aza-bicyclo[3.2.0]heptane-2-carboxylate
SMILES C[C@H](O)[C@H]1[C@@H]2N([C@@H](C([O-])=O)C(C)(C)S2(=O)=O)C1=O
InChI Key InChIKey=JWBKZXUHEFRKRV-SKHQTKALSA-M
Data  2 IC50
  Tab Delimited (TSV)   2D SDfile   Computed 3D by Vconf -m prep SDfile
Find this compound or compounds like it in BindingDB:
Activity Spreadsheet -- Enzyme Inhibition Constant Data from BindingDB
Found 2 hits for monomerid = 50076673
TargetBeta-lactamase(Escherichia coli)
Wyeth-Ayerst Research
Curated by ChEMBL
LigandPNGBDBM50076673(CHEMBL175189 | Sodium; (2S,5R,6R)-6-((S)-1-hydroxy...)
Affinity DataIC50:  120nM. Assay description: Inhibitory activity of the compound against AmpC (class C) beta-lactamase
In DepthDetails ArticlePubMed
TargetBeta-lactamase TEM(Escherichia coli)
Wyeth-Ayerst Research
Curated by ChEMBL
LigandPNGBDBM50076673(CHEMBL175189 | Sodium; (2S,5R,6R)-6-((S)-1-hydroxy...)
Affinity DataIC50:  2.04E+5nM. Assay description: Inhibitory activity of the compound against TEM-1 (class A) beta-lactamase
In DepthDetails ArticlePubMed