BDBM50077043 3,3-Dimethyl-1,2,3,4-tetrahydro-quinoline-8-sulfonic acid ((S)-1-benzothiazol-2-ylmethyl-2-{4-[2-(3-ethyl-ureido)-ethyl]-piperidin-1-yl}-2-oxo-ethyl)-amide::CHEMBL27267
SMILES CCNC(=O)NCCC1CCN(CC1)C(=O)[C@H](Cc1nc2ccccc2s1)NS(=O)(=O)c1cccc2CC(C)(C)CNc12
InChI Key InChIKey=PRBJKHXLDVTRPN-DEOSSOPVSA-N
Data  1 KI
  Tab Delimited (TSV)   2D SDfile   Computed 3D by Vconf -m prep SDfile
Find this compound or compounds like it in BindingDB:
Activity Spreadsheet -- Enzyme Inhibition Constant Data from BindingDB
Found 1 hit for monomerid = 50077043
TargetProthrombin(Homo sapiens (Human))
Novartis Horsham Research Center
Curated by ChEMBL
LigandPNGBDBM50077043(3,3-Dimethyl-1,2,3,4-tetrahydro-quinoline-8-sulfon...)
Affinity DataKi:  65nM. Assay description: Inhibition of human thrombin (in vitro)
In DepthDetails ArticlePubMed